concepts
type: Collection
type: ConceptGroup
member: service innovation

innovation
type: Concept
narrower: service innovation

service innovation
type: Concept
broader: innovation
definition: Innovation in services, or service innovation, is defined in the Oslo Manual by the Organisation for Economic Co-operation and Development (OECD) and Eurostat as “new services that significantly improve customers' access to goods or services.” The Oslo Manual strives to highlight some general characteristics that apply to most services, although at the same time acknowledging that services include a wide range of different types of business models and activities. Here it will be worthwhile to review the general characteristics first and then discuss classifications focusing on intraservices' similarities and differences, as well as some of the findings and controversies within research on service innovation.The Oslo Manual notes that the distinction between products and processes is often blurred. [Source: Encyclopedia of New Venture Management; Service Innovation]