concepts
type: Collection
type: ConceptGroup
member: small group networks

small group networks
type: Concept
broader: social science of networking
definition: Group structure has been analyzed within the social network domain since its inception. Key variables that can be considered during its analysis include relations, communication patterns, functional roles, team makeup, power structures, group standards, aspirations, cohesiveness, and so on. [Source: Encyclopedia of Social Networks; Small Group Networks]

social science of networking
type: Concept
narrower: small group networks