concepts
type: Collection
type: ConceptGroup
member: social context research

inquiry and research
type: Concept
narrower: social context research

social context research
type: Concept
broader: inquiry and research
definition: Social context research is a broad and vital endeavor in the field of curriculum studies. In general, social context research within curriculum studies entails two major perspectives. [Source: Encyclopedia of Curriculum Studies; Social Context Research]