concepts
type: Collection
type: ConceptGroup
member: spatial inequality

social geography
type: Concept
narrower: spatial inequality

spatial inequality
type: Concept
broader: social geography
definition: The term spatial, when applied in the context of human geography, refers to the geographic dimensions of human relations and practices. The term inequality refers to the concept that relationships are uneven or unjust, reflecting differences in power, representation, mobility, and/or access to resources. [Source: Encyclopedia of Human Geography; Spatial Inequality]