card games
type: Concept
narrower: spit

concepts
type: Collection
type: ConceptGroup
member: spit

spit
type: Concept
broader: card games
definition: Spit, or saliva, is almost entirely pure water. It consists of only about 1% solid material. [Source: Encyclopedia of African Religion; Spit]