concepts
type: Collection
type: ConceptGroup
member: standardization

manufacturing and operations
type: Concept
narrower: standardization

standardization
type: Concept
broader: manufacturing and operations
definition: Standardization is a term that is used in variety of ways in research design. The three most common uses of the term relate to standardization of procedure, standardization of interpretation, and standardization of scores. [Source: Encyclopedia of Research Design; Standardization]