concepts
type: Collection
type: ConceptGroup
member: steering

public-sector management
type: Concept
narrower: steering

steering
type: Concept
broader: public-sector management
definition: Steering is one of the metaphors commonly associated with governance. Scholars have discussed governing in terms of the role of the coxswain and have noted that there may be several helmsmen involved in the steering process, with politicians and bureaucrats often competing for control over policy. [Source: Encyclopedia of Governance; Steering]