concepts
type: Collection
type: ConceptGroup
member: structural equivalence

social network analysis
type: Concept
narrower: structural equivalence

structural equivalence
type: Concept
broader: social network analysis
definition: Structural equivalence (sometimes called streq) is one of the most important concepts in social network analysis and is related to a broader theoretical context in the field. It has faced some criticisms, which has stirred up some recurring debates. [Source: Encyclopedia of Social Networks; Structural Equivalence]