concepts
type: Collection
type: ConceptGroup
member: structural theory

social network analysis
type: Concept
narrower: structural theory

structural theory
type: Concept
broader: social network analysis
definition: any theory in criminology that emphasizes the role of immutable structures in society in the genesis and transmission of crime and delinquency. [Source: The Concise Dictionary of Crime and Justice; Structural Theory]