concepts
type: Collection
type: ConceptGroup
member: super-peer theory

super-peer theory
type: Concept
broader: theories
definition: There are a number of theories regarding exactly how the media have an impact on children and teenagers. One of the more cogent and recent ones is the superpeer theory, which applies particularly to adolescents. [Source: Encyclopedia of Children, Adolescents, and the Media; Super-Peer Theory]

theories
type: Concept
narrower: super-peer theory