concepts
type: Collection
type: ConceptGroup
member: tactile acuity

skin and body senses
type: Concept
narrower: tactile acuity

tactile acuity
type: Concept
broader: skin and body senses
definition: When an object is too small or too far off in the distance, we cannot identify it visually. We can detect its presence but cannot make out its features. [Source: Encyclopedia of Perception; Tactile Acuity]