chemical senses
type: Concept
narrower: taste thresholds and intensity

concepts
type: Collection
type: ConceptGroup
member: taste thresholds and intensity

taste thresholds and intensity
type: Concept
broader: chemical senses
definition: Perceptual scientists often study sensory responses at two levels: responses to weak and to strong stimuli. The simplest form of weak stimulus study is the measurement of absolute detection threshold. [Source: Encyclopedia of Perception; Taste Thresholds and Intensity]