concepts
type: Collection
type: ConceptGroup
member: team-based rewards

groups, teams, and teamwork
type: Concept
narrower: team-based rewards

team-based rewards
type: Concept
broader: groups, teams, and teamwork
definition: Rewards for performance are commonly used to maximize work output and productivity. With the increased use of team-based work, a variety of team-based reward systems have been developed, with the intent of maximizing performance and satisfaction in work teams. [Source: Encyclopedia of Industrial and Organizational Psychology; Team-Based Rewards]