concepts
type: Collection
type: ConceptGroup
member: technodistortions

media
type: Concept
narrower: technodistortions

technodistortions
type: Concept
broader: media
definition: TechnoDistortions is a word that has been used to describe the distortions in audio and video messages caused by the use of various technologies to alter the messages. TechnoDistortions have been defined by Lynda Lee Kaid and other researchers as any use of technology that may give the viewer a false, distorted, deceptive, or misleading impression. [Source: Encyclopedia of Political Communication; Technodistortions]