concepts
type: Collection
type: ConceptGroup
member: temporal resolution

geographic information systems
type: Concept
narrower: temporal resolution

temporal resolution
type: Concept
broader: geographic information systems
definition: Temporal resolution, well defined in the field of remote sensing, is one of four major resolutions that characterize a remote sensing system; the others are spectral, spatial, and radiometric resolutions. Temporal resolution is the length of time that has elapsed between measurements and captures the rate of data collection for a particular area. [Source: Encyclopedia of Geography; Temporal Resolution]