concepts
type: Collection
type: ConceptGroup
member: the black scholar

journals
type: Concept
narrower: the black scholar

the black scholar
type: Concept
broader: journals
definition: The Black Scholar was founded by Robert Chrisman and Robert Allen in 1969 in Oakland, California. It has become one of the most important intellectual journals in the black world by virtue of its high standards. [Source: Encyclopedia of Black Studies; The Black Scholar]