assessment areas and techniques
type: Concept
narrower: tolerance for ambiguity

concepts
type: Collection
type: ConceptGroup
member: tolerance for ambiguity

tolerance for ambiguity
type: Concept
broader: assessment areas and techniques
definition: Tolerance for ambiguity can be defined as the degree to which an individual is comfortable with uncertainty, unpredictability, conflicting directions, and multiple demands. In essence, tolerance for ambiguity is manifest in a person's ability to operate effectively in an uncertain environment. [Source: Encyclopedia of Career Development; Tolerance for Ambiguity]