concepts
type: Collection
type: ConceptGroup
member: training of eyewitnesses

eyewitness memory
type: Concept
narrower: training of eyewitnesses

training of eyewitnesses
type: Concept
broader: eyewitness memory
definition: The ability to accurately recognize others is important to everyone, particularly because important social, personal, physical, and economic resources are uniquely associated with individual persons. The recognition training that most people experience comes with everyday social interaction, containing the incentives within their social environment. [Source: Encyclopedia of Psychology and Law; Training of Eyewitnesses]