concepts
type: Collection
type: ConceptGroup
member: transport policy

public policy
type: Concept
narrower: transport policy

transport policy
type: Concept
broader: public policy
definition: The strategic management and planning of transport (public and private) programmes and projects. It should include awareness of environmental change, the need for environmental protection and natural hazards. [Source: Encyclopedia of Environmental Change; transport policy]