concepts
type: Collection
type: ConceptGroup
member: triads

social network analysis
type: Concept
narrower: triads

triads
type: Concept
broader: social network analysis
definition: Triads are statuesque portraits of divine trinities. The trinity is a concept that embraces the trilateral manifestation of a divine force. [Source: Encyclopedia of African Religion; Triads]