concepts
type: Collection
type: ConceptGroup
member: tropes

media modes
type: Concept
narrower: tropes

tropes
type: Concept
broader: media modes
definition: Tropes are rhetorical devices or units of metaphor. They are gendered in the same ways that other forms of human communication are gendered. [Source: Encyclopedia of Gender in Media; Tropes]