concepts
type: Collection
type: ConceptGroup
member: unbundling of higher education

educational reform
type: Concept
narrower: unbundling of higher education

unbundling of higher education
type: Concept
broader: educational reform
definition: Unbundling is the disaggregation of complex activities into component parts. Distributed learning provides the opportunity to use unbundling more widely within colleges and universities. [Source: Encyclopedia of Distributed Learning; Unbundling of Higher Education]