bootstrapping
type: Concept
narrower: underlying distribution

methods
type: Collection
type: ConceptGroup
member: underlying distribution

underlying distribution
type: Concept
broader: bootstrapping
definition: The distribution of all possible outcomes of an ∗event. For example, if the event is the result (sum) of a roll of two dice, there are 11 possible sums: 2, 3, 4… 12, distributed as in the following table. [Source: Dictionary of Statistics & Methodology; Underlying Distribution]