competition (business)
type: Concept
narrower: unfair competition

concepts
type: Collection
type: ConceptGroup
member: unfair competition

unfair competition
type: Concept
broader: competition (business)
definition: Unfair competition refers to a wide range of laws dealing with economic injury to a business due to the wrongful actions of a competitor. For example, a competitor using another business's trademark for the purpose of deceiving customers would violate unfair competition laws. [Source: Encyclopedia of Business Ethics and Society; Unfair Competition]