concepts
type: Collection
type: ConceptGroup
member: walking city

urban transportation
type: Concept
narrower: walking city

walking city
type: Concept
broader: urban transportation
definition: The relationship between walking and the city has been conceptualized in numerous different ways. An examination of urban, social, and cultural theoretical writings begins to reveal the multiplicity and complexity of how urban pedestrian movement is both written about and practiced. [Source: Encyclopedia of Urban Studies; Walking City]