concepts
type: Collection
type: ConceptGroup
member: war and poverty

economics of poverty
type: Concept
narrower: war and poverty

war and poverty
type: Concept
broader: economics of poverty
definition: THE 2004 YEARBOOK OF the Stockholm International Peace Research Institute reported that 377 major armed conflicts occurred worldwide in the years from 1990 through 2003. The average number of conflicts during this 14-year period was 27 per year. [Source: Encyclopedia of World Poverty; War and Poverty]