concepts
type: Collection
type: ConceptGroup
member: war termination

war, peace and terrorism
type: Concept
narrower: war termination

war termination
type: Concept
broader: war, peace and terrorism
definition: War termination is the cessation of any conflict with a minimum of one thousand battlefield casualties per year. Disagreements exist within the literature on war termination over how to identify when a conflict has been terminated as well as the causes of war termination. [Source: The Encyclopedia of Political Science; War Termination]