concepts
type: Collection
type: ConceptGroup
member: wargames research group

toy companies
type: Concept
narrower: wargames research group

wargames research group
type: Concept
broader: toy companies
definition: Miniatures Wargaming, that is, fighting battles with painted lead soldiers, is a very old and popular pastime. Rules for these games have been in existence for many years as well, perhaps the most famous being those written by H.G. Wells near the turn of the 20th century. [Source: Encyclopedia of Play in Today's Society; Wargames Research Group]