concepts
type: Collection
type: ConceptGroup
member: ways and means

legislative studies
type: Concept
narrower: ways and means

ways and means
type: Concept
broader: legislative studies
definition: Ways and Means is the name of a committee in the U.S. House of Representatives. The House Ways and Means Committee is the oldest standing committee in the U.S. Congress and is arguably the most powerful. [Source: The Encyclopedia of Political Science; Ways and Means]