concepts
type: Collection
type: ConceptGroup
member: weighted vote systems

representation and electoral systems
type: Concept
narrower: weighted vote systems

weighted vote systems
type: Concept
broader: representation and electoral systems
definition: Weighted vote systems are systems of decision making by taking a vote in which the principle of equality of the vote (i.e., the principle of “one man, one vote, one value”) is not observed. Instead, electors are divided into groups that are differentiated in the voting process. [Source: The Encyclopedia of Political Science; Weighted Vote Systems]