concepts
type: Collection
type: ConceptGroup
member: white knights

vigilantism
type: Concept
narrower: white knights

white knights
type: Concept
broader: vigilantism
definition: A knight is defined as a member of an order or society. “White Knights” are members of the Ku Klux Klan (KKK), a white supremacist organization originally formed in the United States during the Reconstruction era following the Civil War. [Source: Encyclopedia of Murder and Violent Crime; White Knights]