concepts
type: Collection
type: ConceptGroup
member: white racial identity development

human development and life transitions
type: Concept
narrower: white racial identity development

white racial identity development
type: Concept
broader: human development and life transitions
definition: White racial identity development (WRID) theory describes how White individuals develop a sense of themselves as racial beings, acknowledge the realities of structural racism and White privilege, and come to accept race as a healthy aspect of themselves and others. Structural racism is defined here as the policies and practices in the fabric of U.S. society that disadvantage non-White individuals; White privilege refers to the rights, advantages, exemptions, and/or immunities granted to White individuals that non-Whites are not provided. [Source: Encyclopedia of Counseling; White Racial Identity Development]