concepts
type: Collection
type: ConceptGroup
member: worker error

issues in crisis management
type: Concept
narrower: worker error

worker error
type: Concept
broader: issues in crisis management
definition: Webster's online dictionary defines an error as “an act or condition of ignorant or imprudent deviation from a code of behavior” and also “an act involving an unintentional deviation from truth or accuracy.” There are different possibilities and proneness to errors in the workplace by workers. Workers, like all human beings, are all prone to errors. [Source: Encyclopedia of Crisis Management; Worker Error]