Afronography
type: Concept
definition: Afronography is a method of recording and writing the African experience from an Afrocentric perspective. As a method of ascertaining the condition or state of an event, person, or text related to African people, Afronography projects both an ethical and an evaluative dimension. [Source: Encyclopedia of Black Studies; Afronography]
broader: Afrocentricity

Afrocentricity
type: Concept
narrower: Afronography

concepts
type: Collection
type: ConceptGroup
member: Afronography