pollution
type: Concept
narrower: Alaska pipeline

concepts
type: Collection
type: ConceptGroup
member: Alaska pipeline

Alaska pipeline
type: Concept
definition: Oil was discovered on Alaska's North Slope in 1967. Soon thereafter, the state of Alaska sold oil leases worth over $900 million, and established royalties that made Alaska one of the richest states in the nation. [Source: Encyclopedia of Environment and Society; Alaska Pipeline]
broader: pollution