Eastern Europe
type: Concept
narrower: Albania

Albania
type: Concept
definition: Albania is a small and relatively underdeveloped country in southeast Europe. Since the collapse of its communist government in 1991, Albania has transformed itself from an isolated country to one with a government that seeks to take an active part in European affairs. [Source: Encyclopedia of Global Warming & Climate Change; Albania]
broader: Eastern Europe

concepts
type: Collection
type: ConceptGroup
member: Albania