institutions studying climate change
type: Concept
narrower: American Geophysical Union

organizations
type: Collection
type: ConceptGroup
member: American Geophysical Union

American Geophysical Union
type: Concept
definition: THE AMERICAN GEOPHYSICAL Union (AGU) is a nonprofit organization of geophysicists with over 50,000 members from over 140 countries. The AGU's activities are focused on the collection and dissemination of scientific information in the interdisciplinary and international field of geophysics. [Source: Encyclopedia of Global Warming and Climate Change; American Geophysical Union]
broader: institutions studying climate change