Anthropocene
type: Concept
definition: The latest episode in Earth’s history characterised by the dominance of human impacts on many of the processes affecting the geo-ecology of the Earth. The term was coined in the year 2000 by P.J. Crutzen and E. Stoermer to cover approximately the time interval since the industrial revolution (i.e. [Source: Encyclopedia of Environmental Change; Anthropocene]
broader: paleoclimates

paleoclimates
type: Concept
narrower: Anthropocene

concepts
type: Collection
type: ConceptGroup
member: Anthropocene