Babylon
type: Concept
definition: At 2,100 acres, Babylon was the largest and most important urban center in ancient Mesopotamia for over 2,500 years. The ancient city is located on the east bank of the Euphrates River, about 60 miles southwest of Baghdad in modern Iraq. [Source: Encyclopedia of Anthropology; Babylon]
broader: archaeology

archaeology
type: Concept
narrower: Babylon

concepts
type: Collection
type: ConceptGroup
member: Babylon