influences on curriculum studies
type: Concept
narrower: Bakhtinian thought

Bakhtinian thought
type: Concept
definition: Bakhtinian thought contributes to curriculum studies by recognizing that voices cannot exist in isolation; rather, our utterances represent some aspect of our interactions and experiences within society throughout the duration of our lives. In this respect, classrooms represent a microcosm of society where differing voices come into contact to construct a polyphonic truth. [Source: Encyclopedia of Curriculum Studies; Bakhtinian Thought]
broader: influences on curriculum studies

concepts
type: Collection
type: ConceptGroup
member: Bakhtinian thought