West Indies
type: Concept
narrower: Barbados

concepts
type: Collection
type: ConceptGroup
member: Barbados

Barbados
type: Concept
definition: Barbados is the easternmost nation in the Caribbean. Its size is about three times that of Washington, DC (166 square miles). [Source: Encyclopedia of Law Enforcement; Barbados]
broader: West Indies