Barbara Starfield
type: Concept
definition: Barbara Starfield is an internationally recognized health services researcher who is known for her work in primary care. She has devoted much of her career to studying the role and impact of primary care on health systems and the health of populations. [Source: Encyclopedia of Health Services Research; Starfield, Barbara]
broader: key people in health services research

key people in health services research
type: Concept
narrower: Barbara Starfield

people
type: Collection
type: ConceptGroup
member: Barbara Starfield