Benguela Current
type: Concept
definition: THE BENGUELA CURRENT is located in the southern part of the Atlantic Ocean and moves northward from the western coast of South Africa, Namibia, and Angola, merging into the Southern Equatorial Current. It takes its name from the Angolan port of Benguela, which was founded by the Portuguese in 1617. [Source: Encyclopedia of Global Warming and Climate Change; Benguela Current]
broader: oceanography

oceanography
type: Concept
narrower: Benguela Current

concepts
type: Collection
type: ConceptGroup
member: Benguela Current