organizations, schools, and projects
type: Concept
narrower: Bergamo Conference

Bergamo Conference
type: Concept
definition: The Bergamo Conference is an annual meeting of curriculum theorists and practitioners at the Bergamo Center in Dayton, Ohio. The conference started as a series of annual meetings beginning in the early 1970s that were hosted by various curriculum leaders at their home institutions with the first one being hosted by William Pinar at the University of Rochester. [Source: Encyclopedia of Curriculum Studies; Bergamo Conference, The]
broader: organizations, schools, and projects

organizations
type: Collection
type: ConceptGroup
member: Bergamo Conference