Atlantic islands
type: Concept
narrower: Bermuda

concepts
type: Collection
type: ConceptGroup
member: Bermuda

Bermuda
type: Concept
definition: Bermuda consists of 140 islands and islets located in the North Atlantic Ocean east of North Carolina and north of Puerto Rico. These islands, named after Juan de Bermúdez, the Spanish navigator who discovered them in 1505, remained uninhabited for most of the 1500s and early 1600s. [Source: Encyclopedia of Global Religion; Bermuda]
broader: Atlantic islands