organizations
type: Collection
type: ConceptGroup
member: Broadside Press

Broadside Press
type: Concept
definition: The Broadside Press was founded in Detroit, Michigan, in 1965 and lasted until 1977, effectively encompassing the early phase of the Black Studies movement. The objective of the press was to publish the writings, particularly the poetry, of new black writers. [Source: Encyclopedia of Black Studies; Broadside Press]
broader: publishers

publishers
type: Concept
narrower: Broadside Press