concepts
type: Collection
type: ConceptGroup
member: Brunei

Southeastern Asia
type: Concept
narrower: Brunei

Brunei
type: Concept
definition: Brunei (Brunei Darussalam) is an Islamic sultanate located on the northern coast of the island of Kalimantan (Borneo) facing the South China Sea. It is divided into two sections, separated by territory (the Limbang Valley) of the state of Sarawak, Malaysia. [Source: Encyclopedia of Business in Today's World; Brunei]
broader: Southeastern Asia