Buddhist ethics
type: Concept
definition: Buddhist philosophy originates with the teachings of the Buddha (566–486 BCE), which are framed by the goal of eliminating suffering. Buddhist ethics aims at providing the path to achieving this goal. [Source: Encyclopedia of Business Ethics and Society; Buddhist Ethics]
broader: applied business ethics

applied business ethics
type: Concept
narrower: Buddhist ethics

concepts
type: Collection
type: ConceptGroup
member: Buddhist ethics