CAGE screening instrument
type: Concept
definition: The CAGE Questionnaire is the most commonly used screening instrument for alcohol use disorders. The CAGE was designed to quickly screen adults for drinking problems by asking them four questions about their drinking experiences across their lifetime. [Source: Encyclopedia of Substance Abuse Prevention, Treatment, & Recovery; Cage Screening Instrument]
broader: screening, assessment, and diagnosis

screening, assessment, and diagnosis
type: Concept
narrower: CAGE screening instrument

concepts
type: Collection
type: ConceptGroup
member: CAGE screening instrument