Center for Media Education
type: Concept
definition: The Center for Media Education (CME) was a Washington, D.C.-based nonprofit organization that represented the interests of families and children in national media policy debates. Cofounded in 1991 by Kathryn Montgomery, a former professor at the University of California at Los Angeles, and Jeffrey Chester, a filmmaker and activist, CME became best known for leading a series of successful, high-profile policy campaigns during the 1990s. [Source: Encyclopedia of Children, Adolescents, and the Media; Center for Media Education (CME)]
broader: advocacy groups

advocacy groups
type: Concept
narrower: Center for Media Education

organizations
type: Collection
type: ConceptGroup
member: Center for Media Education